{"text_format":"2","workbook":"xlsx","n_sheets":11,"sheets":["Jahresbestenwertung","Brückmann","Max Kierek","Jubiläums","Leo Sinner","Chef","Hauptm.","G.H.- Damen","Glücks","B.S. Duell","Endergebniss 2022"],"not_rendered":{"charts":0,"images":0,"macros":0,"external_links":0,"defined_names":0,"comments":0,"pivot_tables":0},"unopened":[],"bounds":{"document_bytes":16777216,"sheet_cells":100000,"run_cost":"one","rows_first":2000,"rows_last":500,"rows_between":2000,"halvings":0,"cell_chars":16384,"cell_head_chars":4096},"cells_cut":0,"cells_raw":0,"read":"whole","date_system":"1900"}

{"sheet":"Jahresbestenwertung","index":0,"n_rows":49,"n_cols":13,"rows_kept":49,"cut":false,"hidden":false,"merged":[]}
[null,"Jahreswertung 2019",{"$nulls":8}," "]
[null,null,"Pokal","Brückmann","M-Kierek","Jubil.","L-Sinner","Chef","Haupt","Gesamt","Wertung","Nadel","Goldenes"]
["Rg.","Vj.","Reihenfolge",1,2,3,4,5,6," ",null,null,"Gewehr"]
[" "," ","Monat","April","April","Sept.","Sept.","Sept.","Nov.","Ergebnis",null,null," "]
[{"$f":"RANK(K5,$K$5:$K$38)","v":{"$error":"#REF!"}},1,"Benno Sommer",{"$f":"Brückmann!K2","v":48},{"$f":"'Max Kierek'!K2","v":54},{"$f":"Jubiläums!K2","v":50},{"$f":"'Leo Sinner'!K2","v":50},{"$f":"Chef!K2","v":51},{"$f":"Hauptm.!K2","v":46},{"$f":"SUM(D5:I5)","v":299},{"$f":"SUM(D5:I5)-(SMALL(D5:I5,1)+(SMALL(D5:I5,2)))","v":205},{"$f":"IF(K5>=210,\"Gold\",IF(K5>=200,\"Silber\",IF(K5>=185,\"Bronze\",\"\")))","v":"Silber"},2001]
[{"$error":"#REF!"},2,"Brian Gremler",{"$f":"Brückmann!K3","v":53},{"$f":"'Max Kierek'!K3","v":54},{"$f":"Jubiläums!K3","v":52},{"$f":"'Leo Sinner'!K3","v":52},{"$f":"Chef!K3","v":49},{"$f":"Hauptm.!K3","v":52},312,211,"Gold",2001]
[{"$error":"#REF!"},3,"Frank Holz",{"$f":"Brückmann!K4","v":55},{"$f":"'Max Kierek'!K4","v":53},{"$f":"Jubiläums!K4","v":52},{"$f":"'Leo Sinner'!K4","v":52},{"$f":"Chef!K4","v":56},{"$f":"Hauptm.!K4","v":49},317,216,"Gold",1999]
[{"$error":"#REF!"},4,"Christian Breuer",{"$f":"Brückmann!K5","v":0},{"$f":"'Max Kierek'!K5","v":0},{"$f":"Jubiläums!K5","v":0},{"$f":"'Leo Sinner'!K5","v":0},{"$f":"Chef!K5","v":0},{"$f":"Hauptm.!#REF!","v":{"$error":"#REF!"}},{"$error":"#REF!"},{"$error":"#REF!"},{"$error":"#REF!"},1999]
[{"$error":"#REF!"},5,"Rüdiger Winter",{"$f":"Brückmann!K6","v":0},{"$f":"'Max Kierek'!K6","v":0},{"$f":"Jubiläums!K6","v":0},{"$f":"'Leo Sinner'!K6","v":0},{"$f":"Chef!K6","v":0},{"$f":"Hauptm.!K5","v":40},40,40,"",1998]
[{"$error":"#REF!"},6,"Patric Mende",{"$f":"Brückmann!K7","v":54},{"$f":"'Max Kierek'!K7","v":54},{"$f":"Jubiläums!K7","v":54},{"$f":"'Leo Sinner'!K7","v":47},{"$f":"Chef!K7","v":41},{"$f":"Hauptm.!K6","v":52},302,214,"Gold",2012]
[{"$error":"#REF!"},7,"Peter Gremler",{"$f":"Brückmann!K8","v":50},{"$f":"'Max Kierek'!K8","v":41},{"$f":"Jubiläums!K8","v":45},{"$f":"'Leo Sinner'!K8","v":50},{"$f":"Chef!K8","v":46},{"$f":"Hauptm.!K7","v":44},276,191,"Bronze",1999]
[{"$error":"#REF!"},8,"Pascal Weber",{"$f":"Brückmann!#REF!","v":{"$error":"#REF!"}},{"$f":"'Max Kierek'!K9","v":55},{"$f":"Jubiläums!#REF!","v":{"$error":"#REF!"}},{"$f":"'Leo Sinner'!K9","v":50},{"$f":"Chef!K9","v":47},{"$f":"Hauptm.!K8","v":49},{"$error":"#REF!"},{"$error":"#REF!"},{"$error":"#REF!"},2007]
[{"$error":"#REF!"},9,"Stefan Sommer",{"$f":"Brückmann!K9","v":50},{"$f":"'Max Kierek'!K10","v":49},{"$f":"Jubiläums!K9","v":50},{"$f":"'Leo Sinner'!K10","v":48},{"$f":"Chef!K10","v":44},{"$f":"Hauptm.!K9","v":53},294,202,"Silber",2015]
[{"$error":"#REF!"},10,"Thomas Schleese",{"$f":"Brückmann!K10","v":43},{"$f":"'Max Kierek'!K11","v":0},{"$f":"Jubiläums!K10","v":44},{"$f":"'Leo Sinner'!K11","v":47},{"$f":"Chef!K11","v":43},{"$f":"Hauptm.!K10","v":0},177,177,"",2015]
[{"$error":"#REF!"},10,"Robert Finkentey",{"$f":"Brückmann!K11","v":0},{"$f":"'Max Kierek'!K12","v":41},{"$f":"Jubiläums!K11","v":44},{"$f":"'Leo Sinner'!K12","v":55},{"$f":"Chef!K12","v":50},{"$f":"Hauptm.!K11","v":55},245,204,"Silber",2018]
[{"$error":"#REF!"},12,"Dennis Sommer",{"$f":"Brückmann!K12","v":50},{"$f":"'Max Kierek'!K13","v":0},{"$f":"Jubiläums!K12","v":52},{"$f":"'Leo Sinner'!K13","v":0},{"$f":"Chef!K13","v":0},{"$f":"Hauptm.!K12","v":0},102,102,"",2003]
[{"$error":"#REF!"},13,"Theo Hansen",{"$f":"Brückmann!#REF!","v":{"$error":"#REF!"}},{"$f":"'Max Kierek'!#REF!","v":{"$error":"#REF!"}},{"$f":"Jubiläums!#REF!","v":{"$error":"#REF!"}},{"$f":"'Leo Sinner'!K14","v":0},{"$f":"Chef!K14","v":0},{"$f":"Hauptm.!K13","v":44},{"$error":"#REF!"},{"$error":"#REF!"},{"$error":"#REF!"},1999]
[{"$error":"#REF!"},14,"Manfred Weber",{"$f":"Brückmann!K13","v":0},{"$f":"'Max Kierek'!K14","v":0},{"$f":"Jubiläums!K13","v":0},{"$f":"'Leo Sinner'!K15","v":41},{"$f":"Chef!K15","v":35},{"$f":"Hauptm.!K14","v":0},76,76,"",1998]
[{"$error":"#REF!"},15,"Werner Schumacher",{"$f":"Brückmann!K14","v":0},{"$f":"'Max Kierek'!K15","v":38},{"$f":"Jubiläums!K14","v":0},{"$f":"'Leo Sinner'!K16","v":44},{"$f":"Chef!K16","v":46},{"$f":"Hauptm.!K15","v":0},128,128,"",1999]
[{"$error":"#REF!"},16,"Michael Deutenberg",{"$f":"Brückmann!K15","v":31},{"$f":"'Max Kierek'!K16","v":44},{"$f":"Jubiläums!K15","v":44},{"$f":"'Leo Sinner'!K17","v":44},{"$f":"Chef!K17","v":44},{"$f":"Hauptm.!K16","v":0},207,176,"",2000]
[{"$error":"#REF!"},17,"Manfred Hofmann",{"$f":"Brückmann!K16","v":46},{"$f":"'Max Kierek'!K17","v":47},{"$f":"Jubiläums!K16","v":37},{"$f":"'Leo Sinner'!K18","v":0},{"$f":"Chef!K18","v":0},{"$f":"Hauptm.!K17","v":0},130,130,"",1999]
[{"$error":"#REF!"},18,"Sascha Hofmann",{"$f":"Brückmann!K17","v":44},{"$f":"'Max Kierek'!K18","v":0},{"$f":"Jubiläums!K17","v":47},{"$f":"'Leo Sinner'!K19","v":0},{"$f":"Chef!K19","v":0},{"$f":"Hauptm.!K18","v":0},91,91,""," "]
[{"$error":"#REF!"},19,"Gerhard Holz",{"$f":"Brückmann!K18","v":0},{"$f":"'Max Kierek'!K19","v":0},{"$f":"Jubiläums!K18","v":0},{"$f":"'Leo Sinner'!K20","v":0},{"$f":"Chef!K20","v":0},{"$f":"Hauptm.!K19","v":0},0,0,"",1998]
[{"$error":"#REF!"},19,"Jörg Krieg",{"$f":"Brückmann!K19","v":0},{"$f":"'Max Kierek'!K20","v":0},{"$f":"Jubiläums!K19","v":0},{"$f":"'Leo Sinner'!K21","v":0},{"$f":"Chef!K21","v":0},{"$f":"Hauptm.!K20","v":0},0,0,"",1999]
[{"$error":"#REF!"},19,"Martin Sieg",{"$f":"Brückmann!K20","v":0},{"$f":"'Max Kierek'!K21","v":0},{"$f":"Jubiläums!K20","v":0},{"$f":"'Leo Sinner'!K22","v":0},{"$f":"Chef!K22","v":0},{"$f":"Hauptm.!K21","v":0},0,0,"",2000]
[{"$error":"#REF!"},19,"Kai Schindler",{"$f":"Brückmann!K21","v":0},{"$f":"'Max Kierek'!K22","v":0},{"$f":"Jubiläums!K21","v":0},{"$f":"'Leo Sinner'!K23","v":0},{"$f":"Chef!K23","v":0},{"$f":"Hauptm.!K22","v":0},0,0,"",2010]
[{"$error":"#REF!"},19,"Manfred Schindler",{"$f":"Brückmann!K22","v":0},{"$f":"'Max Kierek'!K23","v":0},{"$f":"Jubiläums!K22","v":0},{"$f":"'Leo Sinner'!K24","v":0},{"$f":"Chef!K24","v":0},{"$f":"Hauptm.!K23","v":0},0,0,"",1998]
[{"$error":"#REF!"},19,"Frank Sommer",{"$f":"Brückmann!K23","v":0},{"$f":"'Max Kierek'!K24","v":0},{"$f":"Jubiläums!K23","v":0},{"$f":"'Leo Sinner'!K25","v":0},{"$f":"Chef!K25","v":0},{"$f":"Hauptm.!K24","v":0},0,0,"",1998]
[{"$error":"#REF!"},19,"Friedel Deutenberg",{"$f":"Brückmann!#REF!","v":{"$error":"#REF!"}},{"$f":"'Max Kierek'!#REF!","v":{"$error":"#REF!"}},{"$f":"Jubiläums!#REF!","v":{"$error":"#REF!"}},{"$f":"'Leo Sinner'!K26","v":0},{"$f":"Chef!K26","v":0},{"$f":"Hauptm.!K25","v":0},{"$error":"#REF!"},{"$error":"#REF!"},{"$error":"#REF!"},1999]
[{"$error":"#REF!"},19,"Hermann v d Bey",{"$f":"Brückmann!K24","v":0},{"$f":"'Max Kierek'!K25","v":0},{"$f":"Jubiläums!K24","v":0},{"$f":"'Leo Sinner'!K27","v":0},{"$f":"Chef!K27","v":0},{"$f":"Hauptm.!K26","v":0},0,0,"",2001]
[{"$error":"#REF!"},19,"Gerd Weber",{"$f":"Brückmann!K25","v":0},{"$f":"'Max Kierek'!K26","v":0},{"$f":"Jubiläums!K25","v":0},{"$f":"'Leo Sinner'!K28","v":42},{"$f":"Chef!K28","v":45},{"$f":"Hauptm.!K27","v":42},129,129,"",2000]
[{"$error":"#REF!"},19,"Fabian Grönke",{"$f":"Brückmann!K26","v":0},{"$f":"'Max Kierek'!K27","v":0},{"$f":"Jubiläums!K26","v":0},{"$f":"'Leo Sinner'!K29","v":0},{"$f":"Chef!K29","v":0},{"$f":"Hauptm.!K28","v":0},0,0,""]
[{"$error":"#REF!"},19,"Kevin Sieg",{"$f":"Brückmann!K27","v":0},{"$f":"'Max Kierek'!K28","v":47},{"$f":"Jubiläums!K27","v":0},{"$f":"'Leo Sinner'!#REF!","v":{"$error":"#REF!"}},{"$f":"Chef!#REF!","v":{"$error":"#REF!"}},{"$f":"Hauptm.!#REF!","v":{"$error":"#REF!"}},{"$error":"#REF!"},{"$error":"#REF!"},{"$error":"#REF!"}," "]
[{"$error":"#REF!"},19," ",{"$f":"Brückmann!#REF!","v":{"$error":"#REF!"}},{"$f":"'Max Kierek'!K29","v":0},{"$f":"Jubiläums!K28","v":44},{"$f":"'Leo Sinner'!#REF!","v":{"$error":"#REF!"}},{"$f":"Chef!#REF!","v":{"$error":"#REF!"}},{"$f":"Hauptm.!#REF!","v":{"$error":"#REF!"}},{"$error":"#REF!"},{"$error":"#REF!"},{"$error":"#REF!"}," "]
[{"$error":"#REF!"},19," ",{"$f":"Brückmann!K28","v":47},{"$f":"'Max Kierek'!#REF!","v":{"$error":"#REF!"}},{"$f":"Jubiläums!#REF!","v":{"$error":"#REF!"}},{"$f":"'Leo Sinner'!#REF!","v":{"$error":"#REF!"}},{"$f":"Chef!#REF!","v":{"$error":"#REF!"}},{"$f":"Hauptm.!#REF!","v":{"$error":"#REF!"}},{"$error":"#REF!"},{"$error":"#REF!"},{"$error":"#REF!"}," "]
[{"$error":"#REF!"},19,"Stefan Schmidt",{"$f":"Brückmann!#REF!","v":{"$error":"#REF!"}},{"$f":"'Max Kierek'!#REF!","v":{"$error":"#REF!"}},{"$f":"Jubiläums!#REF!","v":{"$error":"#REF!"}},{"$f":"'Leo Sinner'!#REF!","v":{"$error":"#REF!"}},{"$f":"Chef!#REF!","v":{"$error":"#REF!"}},{"$f":"Hauptm.!#REF!","v":{"$error":"#REF!"}},{"$error":"#REF!"},{"$error":"#REF!"},{"$error":"#REF!"}," "]
[{"$error":"#REF!"},19,"Rolf Fischer",{"$f":"Brückmann!#REF!","v":{"$error":"#REF!"}},{"$f":"'Max Kierek'!#REF!","v":{"$error":"#REF!"}},{"$f":"Jubiläums!#REF!","v":{"$error":"#REF!"}},{"$f":"'Leo Sinner'!#REF!","v":{"$error":"#REF!"}},{"$f":"Chef!#REF!","v":{"$error":"#REF!"}},{"$f":"Hauptm.!#REF!","v":{"$error":"#REF!"}},{"$error":"#REF!"},{"$error":"#REF!"},{"$error":"#REF!"},2006]
[{"$error":"#REF!"},19,"Bernd Karbach",{"$f":"Brückmann!K29","v":0},{"$f":"'Max Kierek'!#REF!","v":{"$error":"#REF!"}},{"$f":"Jubiläums!K29","v":0},{"$f":"'Leo Sinner'!#REF!","v":{"$error":"#REF!"}},{"$f":"Chef!#REF!","v":{"$error":"#REF!"}},{"$f":"Hauptm.!#REF!","v":{"$error":"#REF!"}},{"$error":"#REF!"},{"$error":"#REF!"},{"$error":"#REF!"}]
[" "," "," ",{"$nulls":9}," "]
[]
[null,null,"Gesamt",{"$f":"SUM(D5:D38)","v":{"$error":"#REF!"}},{"$f":"SUM(E5:E38)","v":{"$error":"#REF!"}},{"$error":"#REF!"},{"$error":"#REF!"},{"$error":"#REF!"},{"$error":"#REF!"},{"$error":"#REF!"},{"$error":"#REF!"}]
[null,null,"Schützen",{"$f":"COUNTIF(D5:D38,\">0\")","v":12},{"$f":"COUNTIF(E5:E38,\">0\")","v":12},13,13,13,11,16,{"$f":"SUM(E42:I42)-MIN(E42:I42)","v":51}]
[null," ","Schnitt",{"$f":"D41/D42","v":{"$error":"#REF!"}},{"$error":"#REF!"},{"$error":"#REF!"},{"$error":"#REF!"},{"$error":"#REF!"},{"$error":"#REF!"},{"$error":"#REF!"},{"$f":"K41/K42","v":{"$error":"#REF!"}}]
[]
[null,null,"Wertungsergebnis:","210 Ringe","goldene","Nadel","Legende:",null,null,"fett","Sieger"]
[null,null,null,"200 Ringe","silberne","Nadel",null,null,null,"normal","Ergebnis"]
[null,null,null,"185 Ringe","bronzene","Nadel",null,null,null,"kursiv","vor bzw."]
[{"$nulls":10},"nachgeschossen"]
[null,null,"Stand",{"$f":"TODAY()","v":"2022-12-05"}]

{"sheet":"Brückmann","index":1,"n_rows":29,"n_cols":12,"rows_kept":29,"cut":false,"hidden":false,"merged":[[0,2,0,9]]}
["Lfd.\nNr.","Name"," Schüsse\n  aufgelegt  |   angelegt    |stechen",{"$nulls":7},"∑","Bemerkungen\n(Stechen)"]
[1,{"$f":"Jahresbestenwertung!C5","v":"Benno Sommer"},9,8,6,10,8,7,null,null,{"$f":"SUM(C2:H2)","v":48}]
[2,{"$f":"Jahresbestenwertung!C6","v":"Brian Gremler"},9,9,8,9,9,9,null,null,53,3]
[3,{"$f":"Jahresbestenwertung!C7","v":"Frank Holz"},9,9,9,10,9,9,null,null,55,1]
[4,{"$f":"Jahresbestenwertung!C8","v":"Christian Breuer"},{"$nulls":8},0]
[5,{"$f":"Jahresbestenwertung!C9","v":"Rüdiger Winter"},{"$nulls":8},0]
[6,{"$f":"Jahresbestenwertung!C10","v":"Patric Mende"},10,9,7,10,10,8,null,null,54,2]
[7,{"$f":"Jahresbestenwertung!C11","v":"Peter Gremler"},9,9,8,9,8,7,null,null,50]
[8,{"$f":"Jahresbestenwertung!C13","v":"Stefan Sommer"},10,8,5,10,9,8,null,null,50]
[9,{"$f":"Jahresbestenwertung!C14","v":"Thomas Schleese"},9,8,7,8,8,3,null,null,43]
[10,{"$f":"Jahresbestenwertung!C15","v":"Robert Finkentey"},{"$nulls":8},0]
[11,{"$f":"Jahresbestenwertung!C16","v":"Dennis Sommer"},10,9,8,8,8,7,null,null,50]
[12,{"$f":"Jahresbestenwertung!C18","v":"Manfred Weber"},{"$nulls":8},0]
[13,{"$f":"Jahresbestenwertung!C19","v":"Werner Schumacher"},{"$nulls":8},0]
[14,{"$f":"Jahresbestenwertung!C20","v":"Michael Deutenberg"},10,8,8,3,2,0,null,null,31]
[15,{"$f":"Jahresbestenwertung!C21","v":"Manfred Hofmann"},8,8,7,9,7,7,null,null,46]
[16,{"$f":"Jahresbestenwertung!C22","v":"Sascha Hofmann"},8,7,6,8,9,6,null,null,44]
[17,{"$f":"Jahresbestenwertung!C23","v":"Gerhard Holz"},{"$nulls":8},0]
[18,{"$f":"Jahresbestenwertung!C24","v":"Jörg Krieg"},{"$nulls":8},0]
[19,{"$f":"Jahresbestenwertung!C25","v":"Martin Sieg"},{"$nulls":8},0]
[20,{"$f":"Jahresbestenwertung!C26","v":"Kai Schindler"},{"$nulls":8},0]
[21,{"$f":"Jahresbestenwertung!C27","v":"Manfred Schindler"},{"$nulls":8},0]
[22,{"$f":"Jahresbestenwertung!C28","v":"Frank Sommer"},{"$nulls":8},0]
[23,{"$f":"Jahresbestenwertung!C30","v":"Hermann v d Bey"},{"$nulls":8},0]
[24,{"$f":"Jahresbestenwertung!C31","v":"Gerd Weber"},{"$nulls":8},0]
[25,{"$f":"Jahresbestenwertung!C32","v":"Fabian Grönke"},{"$nulls":8},0]
[26,{"$f":"Jahresbestenwertung!C33","v":"Kevin Sieg"},{"$nulls":8},0]
[27,"Nicolas Gawlita",9,8,8,9,7,6,null,null,47]
[28,{"$f":"Jahresbestenwertung!C38","v":"Bernd Karbach"},{"$nulls":8},0]

{"sheet":"Max Kierek","index":2,"n_rows":29,"n_cols":12,"rows_kept":29,"cut":false,"hidden":false,"merged":[[0,2,0,9]]}
["Lfd.\nNr.","Name"," Schüsse\n  aufgelegt  |   angelegt    |stechen",{"$nulls":7},"∑","Bemerkungen\n(Stechen)"]
[1,{"$f":"Jahresbestenwertung!C5","v":"Benno Sommer"},10,8,9,9,9,9,null,null,54,2]
[2,{"$f":"Jahresbestenwertung!C6","v":"Brian Gremler"},9,9,9,8,9,10,null,null,{"$f":"SUM(C3:H3)","v":54},2]
[3,{"$f":"Jahresbestenwertung!C7","v":"Frank Holz"},9,9,8,9,9,9,null,null,53,3]
[4,{"$f":"Jahresbestenwertung!C8","v":"Christian Breuer"},{"$nulls":8},0]
[5,{"$f":"Jahresbestenwertung!C9","v":"Rüdiger Winter"},{"$nulls":8},0]
[6,{"$f":"Jahresbestenwertung!C10","v":"Patric Mende"},9,9,9,9,9,9,null,null,54,2]
[7,{"$f":"Jahresbestenwertung!C11","v":"Peter Gremler"},8,7,2,8,8,8,null,null,41]
[8,{"$f":"Jahresbestenwertung!C13","v":"Stefan Sommer"},10,9,9,10,9,8,null,null,55,1]
[9,{"$f":"Jahresbestenwertung!C14","v":"Thomas Schleese"},10,9,7,9,8,6,null,null,49]
[10,{"$f":"Jahresbestenwertung!C15","v":"Robert Finkentey"},{"$nulls":8},0]
[11,{"$f":"Jahresbestenwertung!C16","v":"Dennis Sommer"},8,8,7,7,7,4,null,null,41]
[12,{"$f":"Jahresbestenwertung!C18","v":"Manfred Weber"},{"$nulls":8},0]
[13,{"$f":"Jahresbestenwertung!C19","v":"Werner Schumacher"},{"$nulls":8},0]
[14,{"$f":"Jahresbestenwertung!C20","v":"Michael Deutenberg"},10,8,1,7,7,5,null,null,38]
[15,{"$f":"Jahresbestenwertung!C21","v":"Manfred Hofmann"},8,5,5,10,8,8,null,null,44]
[16,{"$f":"Jahresbestenwertung!C22","v":"Sascha Hofmann"},10,9,7,8,7,6,null,null,47]
[17,{"$f":"Jahresbestenwertung!C23","v":"Gerhard Holz"},{"$nulls":8},0]
[18,{"$f":"Jahresbestenwertung!C24","v":"Jörg Krieg"},{"$nulls":8},0]
[19,{"$f":"Jahresbestenwertung!C25","v":"Martin Sieg"},{"$nulls":8},0]
[20,{"$f":"Jahresbestenwertung!C26","v":"Kai Schindler"},{"$nulls":8},0]
[21,{"$f":"Jahresbestenwertung!C27","v":"Manfred Schindler"},{"$nulls":8},0]
[22,{"$f":"Jahresbestenwertung!C28","v":"Frank Sommer"},{"$nulls":8},0]
[23,{"$f":"Jahresbestenwertung!C30","v":"Hermann v d Bey"},{"$nulls":8},0]
[24,{"$f":"Jahresbestenwertung!C31","v":"Gerd Weber"},{"$nulls":8},0]
[25,{"$f":"Jahresbestenwertung!C32","v":"Fabian Grönke"},{"$nulls":8},0]
[26,{"$f":"Jahresbestenwertung!C33","v":"Kevin Sieg"},{"$nulls":8},0]
[27,"Nicolas Gawlita",10,8,7,8,8,6,null,null,47]
[28,{"$f":"Jahresbestenwertung!C38","v":"Bernd Karbach"},{"$nulls":8},0]

{"sheet":"Jubiläums","index":3,"n_rows":29,"n_cols":12,"rows_kept":29,"cut":false,"hidden":false,"merged":[[0,2,0,9]]}
["Lfd.\nNr.","Name"," Schüsse\n  aufgelegt  |   angelegt    |stechen",{"$nulls":7},"∑","Bemerkungen\n(Stechen)"]
[1,{"$f":"Jahresbestenwertung!C5","v":"Benno Sommer"},8,8,9,8,8,9,null,null,50]
[2,{"$f":"Jahresbestenwertung!C6","v":"Brian Gremler"},10,9,6,10,9,8,null,null,{"$f":"SUM(C3:H3)","v":52}]
[3,{"$f":"Jahresbestenwertung!C7","v":"Frank Holz"},10,9,7,10,9,7,null,null,{"$f":"SUM(C4:H4)","v":52}]
[4,{"$f":"Jahresbestenwertung!C8","v":"Christian Breuer"},{"$nulls":8},0]
[5,{"$f":"Jahresbestenwertung!C9","v":"Rüdiger Winter"},{"$nulls":8},0]
[6,{"$f":"Jahresbestenwertung!C10","v":"Patric Mende"},10,9,8,10,9,8,null,null,54]
[7,{"$f":"Jahresbestenwertung!C11","v":"Peter Gremler"},10,7,3,9,8,8,null,null,45]
[8,{"$f":"Jahresbestenwertung!C13","v":"Stefan Sommer"},10,9,9,9,8,5,null,null,50]
[9,{"$f":"Jahresbestenwertung!C14","v":"Thomas Schleese"},8,5,5,9,9,8,null,null,44]
[10,{"$f":"Jahresbestenwertung!C15","v":"Robert Finkentey"},7,7,6,10,7,7,null,null,44]
[11,{"$f":"Jahresbestenwertung!C16","v":"Dennis Sommer"},10,8,7,9,10,8,null,null,52]
[12,{"$f":"Jahresbestenwertung!C18","v":"Manfred Weber"},{"$nulls":8},0]
[13,{"$f":"Jahresbestenwertung!C19","v":"Werner Schumacher"},{"$nulls":8},0]
[14,{"$f":"Jahresbestenwertung!C20","v":"Michael Deutenberg"},10,9,8,9,8,0,null,null,44]
[15,{"$f":"Jahresbestenwertung!C21","v":"Manfred Hofmann"},10,7,5,6,6,3,null,null,37]
[16,{"$f":"Jahresbestenwertung!C22","v":"Sascha Hofmann"},9,9,7,9,7,6,null,null,47]
[17,{"$f":"Jahresbestenwertung!C23","v":"Gerhard Holz"},{"$nulls":8},0]
[18,{"$f":"Jahresbestenwertung!C24","v":"Jörg Krieg"},{"$nulls":8},0]
[19,{"$f":"Jahresbestenwertung!C25","v":"Martin Sieg"},{"$nulls":8},0]
[20,{"$f":"Jahresbestenwertung!C26","v":"Kai Schindler"},{"$nulls":8},0]
[21,{"$f":"Jahresbestenwertung!C27","v":"Manfred Schindler"},{"$nulls":8},0]
[22,{"$f":"Jahresbestenwertung!C28","v":"Frank Sommer"},{"$nulls":8},0]
[23,{"$f":"Jahresbestenwertung!C30","v":"Hermann v d Bey"},{"$nulls":8},0]
[24,{"$f":"Jahresbestenwertung!C31","v":"Gerd Weber"},{"$nulls":8},0]
[25,{"$f":"Jahresbestenwertung!C32","v":"Fabian Grönke"},{"$nulls":8},0]
[26,{"$f":"Jahresbestenwertung!C33","v":"Kevin Sieg"},{"$nulls":8},0]
[27,"Nicolas Gawlita",7,7,5,10,8,7,null,null,44]
[28,{"$f":"Jahresbestenwertung!C38","v":"Bernd Karbach"},{"$nulls":8},0]

{"sheet":"Leo Sinner","index":4,"n_rows":29,"n_cols":12,"rows_kept":29,"cut":false,"hidden":false,"merged":[[0,2,0,9]]}
["Lfd.\nNr.","Name"," Schüsse\n  aufgelegt  |   angelegt    |stechen",{"$nulls":7},"∑","Bemerkungen\n(Stechen)"]
[1,{"$f":"Jahresbestenwertung!C5","v":"Benno Sommer"},9,9,6,10,10,6,null,null,50]
[2,{"$f":"Jahresbestenwertung!C6","v":"Brian Gremler"},10,9,8,9,8,8,null,null,{"$f":"SUM(C3:H3)","v":52}]
[3,{"$f":"Jahresbestenwertung!C7","v":"Frank Holz"},9,9,9,10,8,7,null,null,52]
[4,{"$f":"Jahresbestenwertung!C8","v":"Christian Breuer"},{"$nulls":8},0]
[5,{"$f":"Jahresbestenwertung!C9","v":"Rüdiger Winter"},{"$nulls":8},0]
[6,{"$f":"Jahresbestenwertung!C10","v":"Patric Mende"},10,9,4,9,8,7,null,null,47]
[7,{"$f":"Jahresbestenwertung!C11","v":"Peter Gremler"},9,9,8,10,7,7,null,null,50]
[8,{"$f":"Jahresbestenwertung!C13","v":"Stefan Sommer"},10,9,8,8,8,7,null,null,50]
[9,{"$f":"Jahresbestenwertung!C14","v":"Thomas Schleese"},9,7,5,10,9,8,null,null,48]
[10,{"$f":"Jahresbestenwertung!C15","v":"Robert Finkentey"},7,9,8,10,10,3,null,null,47]
[11,{"$f":"Jahresbestenwertung!C16","v":"Dennis Sommer"},10,8,8,10,10,9,null,null,55]
[12,{"$f":"Jahresbestenwertung!C18","v":"Manfred Weber"},{"$nulls":8},0]
[13,{"$f":"Jahresbestenwertung!C19","v":"Werner Schumacher"},{"$nulls":8},0]
[14,{"$f":"Jahresbestenwertung!C20","v":"Michael Deutenberg"},8,7,7,8,7,4,null,null,41]
[15,{"$f":"Jahresbestenwertung!C21","v":"Manfred Hofmann"},9,6,4,9,9,7,null,null,44]
[16,{"$f":"Jahresbestenwertung!C22","v":"Sascha Hofmann"},9,8,6,9,6,6,null,null,44]
[17,{"$f":"Jahresbestenwertung!C23","v":"Gerhard Holz"},{"$nulls":8},0]
[18,{"$f":"Jahresbestenwertung!C24","v":"Jörg Krieg"},{"$nulls":8},0]
[19,{"$f":"Jahresbestenwertung!C25","v":"Martin Sieg"},{"$nulls":8},0]
[20,{"$f":"Jahresbestenwertung!C26","v":"Kai Schindler"},{"$nulls":8},0]
[21,{"$f":"Jahresbestenwertung!C27","v":"Manfred Schindler"},{"$nulls":8},0]
[22,{"$f":"Jahresbestenwertung!C28","v":"Frank Sommer"},{"$nulls":8},0]
[23,{"$f":"Jahresbestenwertung!C30","v":"Hermann v d Bey"},{"$nulls":8},0]
[24,{"$f":"Jahresbestenwertung!C31","v":"Gerd Weber"},{"$nulls":8},0]
[25,{"$f":"Jahresbestenwertung!C32","v":"Fabian Grönke"},{"$nulls":8},0]
[26,{"$f":"Jahresbestenwertung!C33","v":"Kevin Sieg"},{"$nulls":8},0]
[27,"Nicolas Gawlita",8,5,6,9,8,6,null,null,42]
[28,{"$f":"Jahresbestenwertung!C38","v":"Bernd Karbach"},{"$nulls":8},0]

{"sheet":"Chef","index":5,"n_rows":29,"n_cols":12,"rows_kept":29,"cut":false,"hidden":false,"merged":[[0,2,0,9]]}
["Lfd.\nNr.","Name"," Schüsse\n  aufgelegt  |   angelegt    |stechen",{"$nulls":7},"∑","Bemerkungen\n(Stechen)"]
[1,{"$f":"Jahresbestenwertung!C5","v":"Benno Sommer"},10,10,6,9,9,7,null,null,51]
[2,{"$f":"Jahresbestenwertung!C6","v":"Brian Gremler"},10,8,8,8,8,7,null,null,{"$f":"SUM(C3:H3)","v":49}]
[3,{"$f":"Jahresbestenwertung!C7","v":"Frank Holz"},9,9,9,10,10,9,null,null,56]
[4,{"$f":"Jahresbestenwertung!C8","v":"Christian Breuer"},{"$nulls":8},{"$f":"SUM(C5:H5)","v":0}]
[5,{"$f":"Jahresbestenwertung!C9","v":"Rüdiger Winter"},{"$nulls":8},0]
[6,{"$f":"Jahresbestenwertung!C10","v":"Patric Mende"},9,8,8,7,6,3,null,null,41]
[7,{"$f":"Jahresbestenwertung!C11","v":"Peter Gremler"},9,7,7,8,8,7,null,null,{"$f":"SUM(C8:H8)","v":46}]
[8,{"$f":"Jahresbestenwertung!C13","v":"Stefan Sommer"},10,10,8,9,7,3,null,null,47]
[9,{"$f":"Jahresbestenwertung!C14","v":"Thomas Schleese"},6,7,7,9,8,7,null,null,44]
[10,{"$f":"Jahresbestenwertung!C15","v":"Robert Finkentey"},7,7,6,8,8,7,null,null,43]
[11,{"$f":"Jahresbestenwertung!C16","v":"Dennis Sommer"},9,9,8,10,9,5,null,null,50]
[12,{"$f":"Jahresbestenwertung!C18","v":"Manfred Weber"},{"$nulls":8},0]
[13,{"$f":"Jahresbestenwertung!C19","v":"Werner Schumacher"},{"$nulls":8},0]
[14,{"$f":"Jahresbestenwertung!C20","v":"Michael Deutenberg"},6,5,3,9,7,5,null,null,35]
[15,{"$f":"Jahresbestenwertung!C21","v":"Manfred Hofmann"},10,10,7,7,7,5,null,null,46]
[16,{"$f":"Jahresbestenwertung!C22","v":"Sascha Hofmann"},9,8,8,9,7,3,null,null,44]
[17,{"$f":"Jahresbestenwertung!C23","v":"Gerhard Holz"},{"$nulls":8},0]
[18,{"$f":"Jahresbestenwertung!C24","v":"Jörg Krieg"},{"$nulls":8},0]
[19,{"$f":"Jahresbestenwertung!C25","v":"Martin Sieg"},{"$nulls":8},0]
[20,{"$f":"Jahresbestenwertung!C26","v":"Kai Schindler"},{"$nulls":8},0]
[21,{"$f":"Jahresbestenwertung!C27","v":"Manfred Schindler"},{"$nulls":8},0]
[22,{"$f":"Jahresbestenwertung!C28","v":"Frank Sommer"},{"$nulls":8},0]
[23,{"$f":"Jahresbestenwertung!C30","v":"Hermann v d Bey"},{"$nulls":8},0]
[24,{"$f":"Jahresbestenwertung!C31","v":"Gerd Weber"},{"$nulls":8},0]
[25,{"$f":"Jahresbestenwertung!C32","v":"Fabian Grönke"},{"$nulls":8},0]
[26,{"$f":"Jahresbestenwertung!C33","v":"Kevin Sieg"},{"$nulls":8},0]
[27,"Nicolas Gawlita",9,8,6,9,8,5,null,null,45]
[28,{"$f":"Jahresbestenwertung!C38","v":"Bernd Karbach"},{"$nulls":8},0]

{"sheet":"Hauptm.","index":6,"n_rows":30,"n_cols":12,"rows_kept":30,"cut":false,"hidden":false,"merged":[[0,2,0,9]]}
["Lfd.\nNr.","Name"," Schüsse\n  aufgelegt  |   angelegt    |stechen",{"$nulls":7},"∑","Bemerkungen\n(Stechen)"]
[1,{"$f":"Jahresbestenwertung!C5","v":"Benno Sommer"},9,7,6,10,8,6,null,null,46]
[2,{"$f":"Jahresbestenwertung!C6","v":"Brian Gremler"},10,9,7,10,8,8,null,null,{"$f":"SUM(C3:H3)","v":52}]
[3,{"$f":"Jahresbestenwertung!C7","v":"Frank Holz"},8,8,7,9,9,8,null,null,49]
[4,{"$f":"Jahresbestenwertung!C9","v":"Rüdiger Winter"},6,6,7,6,8,7,null,null,40]
[5,{"$f":"Jahresbestenwertung!C10","v":"Patric Mende"},9,8,8,10,9,8,null,null,52]
[6,{"$f":"Jahresbestenwertung!C11","v":"Peter Gremler"},10,8,5,10,6,5,null,null,44]
[7,{"$f":"Jahresbestenwertung!C13","v":"Stefan Sommer"},10,8,6,9,8,8,null,null,49]
[8,{"$f":"Jahresbestenwertung!C14","v":"Thomas Schleese"},10,9,9,9,8,8,null,null,53]
[9,{"$f":"Jahresbestenwertung!C15","v":"Robert Finkentey"},{"$nulls":8},0]
[10,{"$f":"Jahresbestenwertung!C16","v":"Dennis Sommer"},10,9,8,10,10,8,null,null,55]
[11,{"$f":"Jahresbestenwertung!C18","v":"Manfred Weber"},{"$nulls":8},0]
[12,{"$f":"Jahresbestenwertung!C19","v":"Werner Schumacher"},10,8,7,9,5,5,null,null,44]
[13,{"$f":"Jahresbestenwertung!C20","v":"Michael Deutenberg"},{"$nulls":8},0]
[14,{"$f":"Jahresbestenwertung!C21","v":"Manfred Hofmann"},{"$nulls":8},0]
[15,{"$f":"Jahresbestenwertung!C22","v":"Sascha Hofmann"},{"$nulls":8},0]
[16,{"$f":"Jahresbestenwertung!C23","v":"Gerhard Holz"},{"$nulls":8},{"$f":"SUM(C17:H17)","v":0}]
[17,{"$f":"Jahresbestenwertung!C24","v":"Jörg Krieg"},{"$nulls":8},{"$f":"SUM(C18:H18)","v":0}]
[18,{"$f":"Jahresbestenwertung!C25","v":"Martin Sieg"},{"$nulls":8},0]
[19,{"$f":"Jahresbestenwertung!C26","v":"Kai Schindler"},{"$nulls":8},0]
[20,{"$f":"Jahresbestenwertung!C27","v":"Manfred Schindler"},{"$nulls":8},0]
[21,{"$f":"Jahresbestenwertung!C28","v":"Frank Sommer"},{"$nulls":8},0]
[22,{"$f":"Jahresbestenwertung!C30","v":"Hermann v d Bey"},{"$nulls":8},0]
[23,{"$f":"Jahresbestenwertung!C31","v":"Gerd Weber"},{"$nulls":8},0]
[24,{"$f":"Jahresbestenwertung!C32","v":"Fabian Grönke"},{"$nulls":8},0]
[25,{"$f":"Jahresbestenwertung!C33","v":"Kevin Sieg"},{"$nulls":8},0]
[26,"Nicolas Gawlita",8,8,5,9,6,6,null,null,42]
[27,{"$f":"Jahresbestenwertung!C38","v":"Bernd Karbach"},{"$nulls":8},0]
[28,"Manuel Herbrand",9,7,6,10,7,8,null,null,47]
[29,"Stefan Schmidt",9,7,7,8,5,6,null,null,42]

{"sheet":"G.H.- Damen","index":7,"n_rows":35,"n_cols":12,"rows_kept":35,"cut":false,"hidden":false,"merged":[[0,2,0,9]]}
["Lfd.\nNr.","Name","abgegebene Schüsse",{"$nulls":7},"∑","Bemerkungen\n(Stechen)"]
[1,"Claudia Schindler",9,9,9,6,6,null,null,null,{"$f":"SUM(C2:J2)","v":39}]
[2,"Renate Schumacher",1,1,4,4,8,null,null,null,{"$f":"SUM(C3:J3)","v":18}]
[3,"Christa Mackethun",1,2,{"$nulls":6},3]
[4,"Andrea Krieg",2,2,1,10,7,null,null,null,22]
[5,"Michelle Krieg",4,6,8,7,7,null,null,null,32]
[6,"Judy Scherf-Schleese",4,6,7,7,8,null,null,null,32]
[7,"Daniela Sommer",8,7,9,8,7,null,null,null,39]
[8,"Jessica Golnik",8,9,6,5,3,null,null,null,31]
[9,{"$nulls":9},0]
[10,{"$nulls":9},0]
[11,{"$nulls":9},0]
[12,{"$nulls":9},0]
[13,{"$nulls":9},0]
[14,{"$nulls":9},0]
[15,{"$nulls":9},0]
[16,{"$nulls":9},0]
[17]
[18]
[19]
[20]
[21]
[22]
[23]
[24]
[25]
[26]
[27]
[28]
[29]
[30]
[31]
[32]
[33]
[34]

{"sheet":"Glücks","index":8,"n_rows":29,"n_cols":11,"rows_kept":29,"cut":false,"hidden":false,"merged":[[0,2,0,8]]}
["Lfd.\nNr.","Name","abgegebene Schüsse",{"$nulls":6},"∑","Bemerkungen\n(Stechen)"]
[1,{"$f":"Jahresbestenwertung!C5","v":"Benno Sommer"},{"$nulls":8},20]
[2,{"$f":"Jahresbestenwertung!C6","v":"Brian Gremler"},{"$nulls":8},"190/1"]
[3,{"$f":"Jahresbestenwertung!C7","v":"Frank Holz"},{"$nulls":8},"180/2"]
[4,{"$f":"Jahresbestenwertung!C8","v":"Christian Breuer"}]
[5,{"$f":"Jahresbestenwertung!C9","v":"Rüdiger Winter"}]
[6,{"$f":"Jahresbestenwertung!C10","v":"Patric Mende"},{"$nulls":8},60]
[7,{"$f":"Jahresbestenwertung!C11","v":"Peter Gremler"},{"$nulls":8},70]
[8,{"$f":"Jahresbestenwertung!C13","v":"Stefan Sommer"},{"$nulls":8},60]
[9,{"$f":"Jahresbestenwertung!C14","v":"Thomas Schleese"},{"$nulls":8},"130/3"]
[10,{"$f":"Jahresbestenwertung!C15","v":"Robert Finkentey"}]
[11,{"$f":"Jahresbestenwertung!C16","v":"Dennis Sommer"},{"$nulls":8},"180/2"]
[12,{"$f":"Jahresbestenwertung!C18","v":"Manfred Weber"}]
[13,{"$f":"Jahresbestenwertung!C19","v":"Werner Schumacher"}]
[14,{"$f":"Jahresbestenwertung!C20","v":"Michael Deutenberg"},{"$nulls":8},10]
[15,{"$f":"Jahresbestenwertung!C21","v":"Manfred Hofmann"},{"$nulls":8},30]
[16,{"$f":"Jahresbestenwertung!C22","v":"Sascha Hofmann"},{"$nulls":8},0]
[17,{"$f":"Jahresbestenwertung!C23","v":"Gerhard Holz"}]
[18,{"$f":"Jahresbestenwertung!C24","v":"Jörg Krieg"}]
[19,{"$f":"Jahresbestenwertung!C25","v":"Martin Sieg"}]
[20,{"$f":"Jahresbestenwertung!C26","v":"Kai Schindler"}]
[21,{"$f":"Jahresbestenwertung!C27","v":"Manfred Schindler"}]
[22,{"$f":"Jahresbestenwertung!C28","v":"Frank Sommer"}]
[23,{"$f":"Jahresbestenwertung!C30","v":"Hermann v d Bey"}]
[24,{"$f":"Jahresbestenwertung!C31","v":"Gerd Weber"}]
[25,{"$f":"Jahresbestenwertung!C32","v":"Fabian Grönke"}]
[26,{"$f":"Jahresbestenwertung!C33","v":"Kevin Sieg"}]
[27,"Nicolas Gawlita",{"$nulls":8},70]
[28,{"$f":"Jahresbestenwertung!C38","v":"Bernd Karbach"}]

{"sheet":"B.S. Duell","index":9,"n_rows":37,"n_cols":8,"rows_kept":37,"cut":false,"hidden":false,"merged":[[11,1,12,1],[17,0,19,7],[1,3,8,3],[9,3,16,3],[1,4,16,4],[13,1,14,1],[15,1,16,1],[1,2,4,2],[5,2,8,2],[9,2,12,2],[13,2,16,2],[1,1,2,1],[3,1,4,1],[5,1,6,1],[7,1,8,1],[9,1,10,1],[21,1,22,1],[21,2,24,2],[21,3,28,3],[21,4,36,4],[23,1,24,1],[25,1,26,1],[37,0,39,7],[25,2,28,2],[27,1,28,1],[29,1,30,1],[29,2,32,2],[29,3,36,3],[31,1,32,1],[33,1,34,1],[33,2,36,2],[35,1,36,1]]}
["Duell - Luftpistole","Duell - Luftgewehr","Duell - Luftpistole","Duell - Luftgewehr","Pokalsieger"]
{"$rows_empty":19}
["Duell - Luftgewehr","Duell - Kleinkaliber","Duell - Luftgewehr","Duell - Kleinkaliber","Duell - Luftgewehr","Duell - Kleinkaliber","Duell - Luftgewehr","Duell - Kleinkaliber"]
[9,9,5,3,2]
[9]
[10,10]
[10]
[11,11,6]
[11]
[12,12]
[12]
[13,13,7,4]
[13]
[14,14]
[14]
[15,15,8]
[15]
[16,16]
[16]

{"sheet":"Endergebniss 2022","index":10,"n_rows":43,"n_cols":13,"rows_kept":43,"cut":false,"hidden":false,"merged":[[0,1,0,10]]}
[null,"Jahreswertung 2022"]
[null,null,"Pokal","Brückmann","M-Kierek","Jubil.","L-Sinner","Chef","Haupt","Gesamt","Wertung","Nadel","Goldenes"]
["Rg.","Vj.","Reihenfolge",1,2,3,4,5,6," ",null,null,"Gewehr"]
[" "," ","Monat","April","April","Sept.","Sept.","Sept.","Nov.","Ergebnis",null,null," "]
[{"$f":"RANK(K5,$K$5:$K$32)","v":1},3,"Frank Holz",55,53,52,52,56,49,{"$f":"SUM(D5:I5)","v":317},{"$f":"SUM(D5:I5)-(SMALL(D5:I5,1)+(SMALL(D5:I5,2)))","v":216},{"$f":"IF(K5>=210,\"Gold\",IF(K5>=200,\"Silber\",IF(K5>=185,\"Bronze\",\"\")))","v":"Gold"},2001]
[{"$f":"RANK(K6,$K$5:$K$32)","v":2},6,"Patric Mende",54,54,54,47,41,52,{"$f":"SUM(D6:I6)","v":302},{"$f":"SUM(D6:I6)-(SMALL(D6:I6,1)+(SMALL(D6:I6,2)))","v":214},{"$f":"IF(K6>=210,\"Gold\",IF(K6>=200,\"Silber\",IF(K6>=185,\"Bronze\",\"\")))","v":"Gold"},2001]
[{"$f":"RANK(K7,$K$5:$K$32)","v":3},12,"Dennis Sommer",50,41,52,55,50,55,{"$f":"SUM(D7:I7)","v":303},{"$f":"SUM(D7:I7)-(SMALL(D7:I7,1)+(SMALL(D7:I7,2)))","v":212},{"$f":"IF(K7>=210,\"Gold\",IF(K7>=200,\"Silber\",IF(K7>=185,\"Bronze\",\"\")))","v":"Gold"},1999]
[{"$f":"RANK(K8,$K$5:$K$32)","v":4},2,"Brian Gremler",53,54,52,52,49,52,{"$f":"SUM(D8:I8)","v":312},{"$f":"SUM(D8:I8)-(SMALL(D8:I8,1)+(SMALL(D8:I8,2)))","v":211},{"$f":"IF(K8>=210,\"Gold\",IF(K8>=200,\"Silber\",IF(K8>=185,\"Bronze\",\"\")))","v":"Gold"}]
[{"$f":"RANK(K9,$K$5:$K$32)","v":5},1,"Benno Sommer",48,54,50,50,51,46,{"$f":"SUM(D9:I9)","v":299},{"$f":"SUM(D9:I9)-(SMALL(D9:I9,1)+(SMALL(D9:I9,2)))","v":205},{"$f":"IF(K9>=210,\"Gold\",IF(K9>=200,\"Silber\",IF(K9>=185,\"Bronze\",\"\")))","v":"Silber"},1998]
[{"$f":"RANK(K10,$K$5:$K$32)","v":5},9,"Stefan Sommer",50,55,50,50,47,49,{"$f":"SUM(D10:I10)","v":301},{"$f":"SUM(D10:I10)-(SMALL(D10:I10,1)+(SMALL(D10:I10,2)))","v":205},{"$f":"IF(K10>=210,\"Gold\",IF(K10>=200,\"Silber\",IF(K10>=185,\"Bronze\",\"\")))","v":"Silber"},2012]
[{"$f":"RANK(K11,$K$5:$K$32)","v":7},10,"Thomas Schleese",43,49,44,48,44,53,{"$f":"SUM(D11:I11)","v":281},{"$f":"SUM(D11:I11)-(SMALL(D11:I11,1)+(SMALL(D11:I11,2)))","v":194},{"$f":"IF(K11>=210,\"Gold\",IF(K11>=200,\"Silber\",IF(K11>=185,\"Bronze\",\"\")))","v":"Bronze"},1999]
[{"$f":"RANK(K12,$K$5:$K$32)","v":8},7,"Peter Gremler",50,41,45,50,46,44,{"$f":"SUM(D12:I12)","v":276},{"$f":"SUM(D12:I12)-(SMALL(D12:I12,1)+(SMALL(D12:I12,2)))","v":191},{"$f":"IF(K12>=210,\"Gold\",IF(K12>=200,\"Silber\",IF(K12>=185,\"Bronze\",\"\")))","v":"Bronze"},2015]
[{"$f":"RANK(K13,$K$5:$K$32)","v":9},19,"Nicolas Gawlita",47,47,44,42,45,42,{"$f":"SUM(D13:I13)","v":267},{"$f":"SUM(D13:I13)-(SMALL(D13:I13,1)+(SMALL(D13:I13,2)))","v":183},{"$f":"IF(K13>=210,\"Gold\",IF(K13>=200,\"Silber\",IF(K13>=185,\"Bronze\",\"\")))","v":""},2015]
[{"$f":"RANK(K14,$K$5:$K$32)","v":10},18,"Sascha Hofmann",44,47,47,44,44,{"$f":"Hauptm.!K20","v":0},{"$f":"SUM(D14:I14)","v":226},{"$f":"SUM(D14:I14)-(SMALL(D14:I14,1)+(SMALL(D14:I14,2)))","v":182},{"$f":"IF(K14>=210,\"Gold\",IF(K14>=200,\"Silber\",IF(K14>=185,\"Bronze\",\"\")))","v":""},2018]
[{"$f":"RANK(K15,$K$5:$K$32)","v":11},17,"Manfred Hofmann",46,44,37,44,46,{"$f":"Hauptm.!K19","v":0},{"$f":"SUM(D15:I15)","v":217},{"$f":"SUM(D15:I15)-(SMALL(D15:I15,1)+(SMALL(D15:I15,2)))","v":180},{"$f":"IF(K15>=210,\"Gold\",IF(K15>=200,\"Silber\",IF(K15>=185,\"Bronze\",\"\")))","v":""},2003]
[{"$f":"RANK(K16,$K$5:$K$32)","v":12},16,"Michael Deutenberg",{"$f":"Brückmann!K15","v":31},38,44,41,35,{"$f":"Hauptm.!K16","v":0},{"$f":"SUM(D16:I16)","v":189},{"$f":"SUM(D16:I16)-(SMALL(D16:I16,1)+(SMALL(D16:I16,2)))","v":158},{"$f":"IF(K16>=210,\"Gold\",IF(K16>=200,\"Silber\",IF(K16>=185,\"Bronze\",\"\")))","v":""},1998]
[{"$f":"RANK(K17,$K$5:$K$32)","v":13},10,"Robert Finkentey",{"$f":"Brückmann!K21","v":0},{"$f":"'Max Kierek'!K22","v":0},44,47,43,{"$f":"Hauptm.!K22","v":0},{"$f":"SUM(D17:I17)","v":134},{"$f":"SUM(D17:I17)-(SMALL(D17:I17,1)+(SMALL(D17:I17,2)))","v":134},{"$f":"IF(K17>=210,\"Gold\",IF(K17>=200,\"Silber\",IF(K17>=185,\"Bronze\",\"\")))","v":""},1999]
[{"$f":"RANK(K18,$K$5:$K$32)","v":14},14,"Manfred Weber",0,0,0,{"$f":"'Leo Sinner'!K14","v":0},{"$f":"Chef!K14","v":0},{"$f":"Hauptm.!K13","v":44},0,{"$f":"SUM(D18:I18)-(SMALL(D18:I18,1)+(SMALL(D18:I18,2)))","v":44},{"$f":"IF(K18>=210,\"Gold\",IF(K18>=200,\"Silber\",IF(K18>=185,\"Bronze\",\"\")))","v":""},2000]
[{"$f":"RANK(K19,$K$5:$K$32)","v":14},15,"Werner Schumacher",0,{"$f":"'Max Kierek'!K13","v":0},null,{"$f":"'Leo Sinner'!K13","v":0},{"$f":"Chef!K13","v":0},44,{"$f":"SUM(D19:I19)","v":44},{"$f":"SUM(D19:I19)-(SMALL(D19:I19,1)+(SMALL(D19:I19,2)))","v":44},{"$f":"IF(K19>=210,\"Gold\",IF(K19>=200,\"Silber\",IF(K19>=185,\"Bronze\",\"\")))","v":""},1999]
[{"$f":"RANK(K20,$K$5:$K$32)","v":16},19,"Gerd Weber",{"$f":"Brückmann!K25","v":0},{"$f":"'Max Kierek'!K26","v":0},{"$f":"Jubiläums!K25","v":0},null,null,{"$f":"Hauptm.!K27","v":42},{"$f":"SUM(D20:I20)","v":42},{"$f":"SUM(D20:I20)-(SMALL(D20:I20,1)+(SMALL(D20:I20,2)))","v":42},{"$f":"IF(K20>=210,\"Gold\",IF(K20>=200,\"Silber\",IF(K20>=185,\"Bronze\",\"\")))","v":""}," "]
[{"$f":"RANK(K21,$K$5:$K$32)","v":17},5,"Rüdiger Winter",0,0,null,null,null,40,{"$f":"SUM(D21:I21)","v":40},{"$f":"SUM(D21:I21)-(SMALL(D21:I21,1)+(SMALL(D21:I21,2)))","v":40},{"$f":"IF(K21>=210,\"Gold\",IF(K21>=200,\"Silber\",IF(K21>=185,\"Bronze\",\"\")))","v":""},1998]
[null,4,"Christian Breuer",{"$nulls":6},{"$f":"SUM(D22:I22)","v":0},null,{"$f":"IF(K22>=210,\"Gold\",IF(K22>=200,\"Silber\",IF(K22>=185,\"Bronze\",\"\")))","v":""},1999]
[null,19,"Gerhard Holz",{"$f":"Brückmann!K13","v":0},{"$f":"'Max Kierek'!K14","v":0},{"$f":"Jubiläums!K13","v":0},null,null,{"$f":"Hauptm.!K14","v":0},{"$f":"SUM(D23:I23)","v":0},{"$f":"SUM(D23:I23)-(SMALL(D23:I23,1)+(SMALL(D23:I23,2)))","v":0},{"$f":"IF(K23>=210,\"Gold\",IF(K23>=200,\"Silber\",IF(K23>=185,\"Bronze\",\"\")))","v":""},2000]
[null,19,"Jörg Krieg",0,0,null,{"$f":"'Leo Sinner'!K18","v":0},{"$f":"Chef!K18","v":0},{"$f":"Hauptm.!K17","v":0},{"$f":"SUM(D24:I24)","v":0},{"$f":"SUM(D24:I24)-(SMALL(D24:I24,1)+(SMALL(D24:I24,2)))","v":0},{"$f":"IF(K24>=210,\"Gold\",IF(K24>=200,\"Silber\",IF(K24>=185,\"Bronze\",\"\")))","v":""},2010]
[null,19,"Martin Sieg",0,{"$f":"'Max Kierek'!K18","v":0},null,{"$f":"'Leo Sinner'!K19","v":0},{"$f":"Chef!K19","v":0},{"$f":"Hauptm.!K18","v":0},{"$f":"SUM(D25:I25)","v":0},{"$f":"SUM(D25:I25)-(SMALL(D25:I25,1)+(SMALL(D25:I25,2)))","v":0},{"$f":"IF(K25>=210,\"Gold\",IF(K25>=200,\"Silber\",IF(K25>=185,\"Bronze\",\"\")))","v":""},1998]
[null,19,"Kai Schindler",{"$f":"Brückmann!K20","v":0},{"$f":"'Max Kierek'!K21","v":0},{"$f":"Jubiläums!K20","v":0},{"$f":"'Leo Sinner'!K22","v":0},{"$f":"Chef!K22","v":0},{"$f":"Hauptm.!K21","v":0},{"$f":"SUM(D26:I26)","v":0},{"$f":"SUM(D26:I26)-(SMALL(D26:I26,1)+(SMALL(D26:I26,2)))","v":0},{"$f":"IF(K26>=210,\"Gold\",IF(K26>=200,\"Silber\",IF(K26>=185,\"Bronze\",\"\")))","v":""},1998]
[null,19,"Manfred Schindler",{"$f":"Brückmann!K22","v":0},{"$f":"'Max Kierek'!K23","v":0},{"$f":"Jubiläums!K22","v":0},{"$f":"'Leo Sinner'!K24","v":0},{"$f":"Chef!K24","v":0},{"$f":"Hauptm.!K23","v":0},{"$f":"SUM(D27:I27)","v":0},{"$f":"SUM(D27:I27)-(SMALL(D27:I27,1)+(SMALL(D27:I27,2)))","v":0},{"$f":"IF(K27>=210,\"Gold\",IF(K27>=200,\"Silber\",IF(K27>=185,\"Bronze\",\"\")))","v":""},2001]
[null,19,"Frank Sommer",{"$f":"Brückmann!K23","v":0},{"$f":"'Max Kierek'!K24","v":0},{"$f":"Jubiläums!K23","v":0},{"$f":"'Leo Sinner'!K25","v":0},{"$f":"Chef!K25","v":0},{"$f":"Hauptm.!K24","v":0},{"$f":"SUM(D28:I28)","v":0},{"$f":"SUM(D28:I28)-(SMALL(D28:I28,1)+(SMALL(D28:I28,2)))","v":0},{"$f":"IF(K28>=210,\"Gold\",IF(K28>=200,\"Silber\",IF(K28>=185,\"Bronze\",\"\")))","v":""},2000]
[null,19,"Hermann v d Bey",{"$f":"Brückmann!K24","v":0},{"$f":"'Max Kierek'!K25","v":0},{"$f":"Jubiläums!K24","v":0},{"$f":"'Leo Sinner'!K27","v":0},{"$f":"Chef!K27","v":0},{"$f":"Hauptm.!K26","v":0},{"$f":"SUM(D29:I29)","v":0},{"$f":"SUM(D29:I29)-(SMALL(D29:I29,1)+(SMALL(D29:I29,2)))","v":0},{"$f":"IF(K29>=210,\"Gold\",IF(K29>=200,\"Silber\",IF(K29>=185,\"Bronze\",\"\")))","v":""}]
[null,19,"Fabian Grönke",{"$f":"Brückmann!K26","v":0},{"$f":"'Max Kierek'!K27","v":0},{"$f":"Jubiläums!K26","v":0},{"$f":"'Leo Sinner'!K29","v":0},{"$f":"Chef!K29","v":0},{"$f":"Hauptm.!K28","v":0},{"$f":"SUM(D30:I30)","v":0},{"$f":"SUM(D30:I30)-(SMALL(D30:I30,1)+(SMALL(D30:I30,2)))","v":0},{"$f":"IF(K30>=210,\"Gold\",IF(K30>=200,\"Silber\",IF(K30>=185,\"Bronze\",\"\")))","v":""}," "]
[null,19,"Kevin Sieg",{"$f":"Brückmann!K27","v":0},0,{"$f":"Jubiläums!K27","v":0},0,0,0,{"$f":"SUM(D31:I31)","v":0},{"$f":"SUM(D31:I31)-(SMALL(D31:I31,1)+(SMALL(D31:I31,2)))","v":0},{"$f":"IF(K31>=210,\"Gold\",IF(K31>=200,\"Silber\",IF(K31>=185,\"Bronze\",\"\")))","v":""}," "]
[null,19,"Bernd Karbach",{"$f":"Brückmann!K29","v":0},0,{"$f":"Jubiläums!K29","v":0},0,0,0,{"$f":"SUM(D32:I32)","v":0},0,{"$f":"IF(K32>=210,\"Gold\",IF(K32>=200,\"Silber\",IF(K32>=185,\"Bronze\",\"\")))","v":""}]
[" "," "," ",{"$nulls":9}," "]
[]
[null,null,"Gesamt",{"$f":"SUM(D5:D32)","v":571},577,615,622,597,612,3550,2655]
[null,null,"Schützen",{"$f":"COUNTIF(D5:D32,\">0\")","v":12},12,13,13,13,13,16,{"$f":"SUM(E36:I36)-MIN(E36:I36)","v":52}]
[null," ","Schnitt",{"$f":"D35/D36","v":47.583333333333336},48.083333333333336,47.307692307692307,47.846153846153847,45.92307692307692,47.07692307692308,221.875,{"$f":"K35/K36","v":51.057692307692307}]
[]
[null,null,"Wertungsergebnis:","210 Ringe","goldene","Nadel","Legende:",null,null,"fett-rot","Sieger"]
[null,null,null,"200 Ringe","silberne","Nadel",null,null,null,"normal","Ergebnis"]
[null,null,null,"185 Ringe","bronzene","Nadel",null,null,null,"kursiv","vor bzw."]
[{"$nulls":10},"nachgeschossen"]
[null,null,"Stand",{"$f":"TODAY()","v":"2022-12-05"}]